{"text_format":"1","workbook":"xlsx","n_sheets":12,"sheets":["Info","R1","R2","BI","BI_C","IN","Em","DI","DI_C","PO","MA","P"],"not_rendered":{"charts":7,"images":2,"macros":1,"external_links":0,"defined_names":56,"comments":0,"pivot_tables":0},"unopened":[],"bounds":{"document_bytes":16777216,"sheet_cells":100000,"rows_first":2000,"rows_last":500,"rows_between":2000,"halvings":0,"cell_chars":16384,"cell_head_chars":4096},"cells_cut":0,"cells_raw":0,"read":"whole","date_system":"1900"}

{"sheet":"Info","index":0,"n_rows":21,"n_cols":7,"rows_kept":21,"cut":false,"hidden":false,"merged":[[20,3,28,5]]}
[]
[]
[null,"Guía interpretación hoja de cálculo"]
[]
[null,null,"Hojas en este archivo"]
[]
[null,null,null,"Nombre hoja","Tipo","Nombre","Descripción"]
[null,null,null,"R1","Resultados","Resultados Principales","Hoja principal de resultados: \n- En esta hoja se pueden visualizar los resultados de cuota de mercado del biodiesel y coste de las políticas de apoyo para alcanzar dichas cuotas de mercado para el período 2017-2036\n- En la parte superior de la hoja se puede seleccionar el escenario a visualizar así como su composición."]
[null,null,null,"R2","Resultados","Resultados Casación","Esta hoja muestra la casación del mercado de biodiesel (calculos de la casación de la oferta y la demanda de biodiesel) para cada año 2017-2036. Modificando el año en la celda D4 se pueden visualizar los resultados de la casación para un año en particular."]
[null,null,null,"BI","Biodiésel","Biodiesel","En esta hoja se presentan los escenarios de potencial y costes de diferentes para los diferentes tipos de biodiesel (para conformar la curva de oferta de biodiesel)"]
[null,null,null,"IN","Biodiésel","Infraestructura conversión","En esta hoja se calcula la evolución de la infraestructura necesaria para atender la demanda de biodiesel, así como la inversión necesaria"]
[null,null,null,"Em","Emisiones","Reducción Emisiones GEI","En esta hoja se muestran los supuestos y el cálculo del rango de factores de reducción de emisión GEI considerados"]
[null,null,null,"DI","Diésel","Diésel","En esta hoja se presentan los escenarios de costes y consumo del gasoil (para conformar la curva de demanda de referencia del diésel)"]
[null,null,null,"DI_C","Diésel","Diésel vs Crudo","En esta hoja de cálculo se obtiene la relación histórica entre precio del crudo y del diésel, para su empleo en los escenarios futuros"]
[null,null,null,"PO","General","Políticas ","En esta hoja se establecen los escenarios de políticas de apoyo al biodiesel, tanto para el caso de incentivo económico como cuotas obligatorias. \n- En el caso de incentivo económico, se introduce el valor inicial a 2016 y éste se proyecta a futuro en base a la evolución de la inflación. \n- En el caso de cuotas, se pueden introducir valores diferenciados para cada año 2017-2036 para cada uno de los tres escenarios."]
[null,null,null,"MA","General","Macroeconómicos","Definición de variables macroeconómicas \n- Tipo de cambio MXN/USD\n- Inflación"]
[null,null,null,"P","General","Parámetros Generales","Hoja de parámetros generales"]
[]
[null,null,"Código de colores"]
[]
{"$rows_left_out":2}
{"sheet":"R1","index":1,"n_rows":136,"n_cols":25,"rows_kept":136,"cut":false,"hidden":false,"merged":[[8,5,8,6]]}
[]
[]
[null,"Hoja de resultados principal (cuota de mercado del biodiesel y coste de políticas)"]
[]
[]
[null,null,"Selección y composición escenarios"]
[]
[]
[null,null,"Escenario de cálculo",null,null,"Supuestos Mercado Diésel",null,null,"Supuesto Políticas "]
[null,null,"Escenario moderado"]
[null,null,null,null,null,"Escenario costo diesel","Escenario consumo diesel",null,"Instrumento apoyo"]
[null,null,null,null,"Escenario tendencial","Barato","Alto",null,"Incentivo Económico"]
[null,null,null,null,"Escenario moderado","Moderado","Moderado",null,"Cuota"]
[null,null,null,null,"Escenario optimista","Caro","Bajo",null,"Cuota"]
[]
[]
[]
[null,null,"Resultados contribución del biodiesel (millones m3 y % cuota mercado)"]
[]
[]
{"$rows_left_out":117}
{"sheet":"R2","index":2,"n_rows":488,"n_cols":42,"rows_kept":488,"cut":false,"hidden":false,"merged":[]}
[]
[null,"Casación oferta y demanda biodiesel por año"]
[]
[null,null,"Año",2017]
[]
[null,null,"Resultados"]
[]
[null,null,"Demanda total biodiesel",{"$f":"IF($V$38>$X$38,0,\n   IF(COUNTIF(Q38:Q488,\"Demandado\")<1,0,\n   IFERROR(INDEX(P38:V488,MATCH(\"TRUE\",P38:P488,0),6),$D$23)))","v":0},"millones m3"]
[null,null,"Demanda atendible",{"$f":"INDEX(Capacidad_Conversión,1,MATCH($D$4,Capacidad_Conversión_FU,0))","v":0},"millones m3"]
[null,null,"Volumen venta biodiesel",{"$f":"IF(D9>D8,D8,D9)","v":0},"millones m3"]
[]
[null,null,"Precio marginal",{"$f":"IF(V34>D24,V34,D24)","v":8.5407399999999996},"peso/litro"]
[]
[null,null,"Costes totales biodiesel",{"$f":"SUMIF($R$39:$R$488,\"vendido\",AB$39:AB$488)","v":0},"millones pesos"]
[null,null,"Costes equivalentes gasoleo",{"$f":"SUMIF($R$39:$R$488,\"vendido\",AC$39:AC$488)","v":0},"millones pesos"]
[null,null,"Costes política apoyo",{"$f":"D14-D15","v":0},"millones pesos"]
[]
[null,null,"Curva demanda biodiesel"]
[]
[null,null,"Instrumento apoyo",{"$f":"INDEX(Escenarios_General,MATCH('R1'!$C$10,Escenarios_General_CU,0),MATCH($C$20,Escenarios_General_FU,0))","v":"Cuota"},{"$f":"IFERROR(INDEX(Objetivos_Politica,MATCH($D20,Objetivos_Politica_CU,0),MATCH($D$4,Objetivos_Politica_FU,0)),\"-\")","v":0}]
{"$rows_left_out":469}
{"sheet":"BI","index":3,"n_rows":51,"n_cols":27,"rows_kept":51,"cut":false,"hidden":false,"merged":[]}
[]
[]
[null,"Escenarios de costes y potencial de biodiesel"]
[]
[]
[null,null,"Costos produccion ($MX/litro)"]
[]
[null,null,"$MX/litro",null,null,null,null,1,2,3,4,5,6,7,8,9,10,11,12,13,14,15,16,17,18,19,20]
[null,null,"Tipo",2016,null,null,null,2017,2018,2019,2020,2021,2022,2023,2024,2025,2026,2027,2028,2029,2030,2031,2032,2033,2034,2035,2036]
[null,1,"Aceites_usados",12.4,null,null,null,{"$f":"IFERROR($D10*H$32,\"-\")","v":13.33688888888889},{"$f":"IFERROR($D10*I$32,\"-\")","v":13.594808888888892},14.551934577777779,14.83090084977778,15.809914661546671,16.111644581341871,17.114332586817767,17.440683668068253,18.468977681457655,18.821959010938183,19.189059593597932,19.570844199564075,19.967900189768859,20.380838419581835,20.810294178587331,21.256928167953042,21.721427516893389,22.204506839791346,22.706909335605225,23.229407931251654]
[null,2,"Cultivos_ClaseCosto1",14.18,null,null,null,{"$f":"IFERROR($D11*H$32,\"-\")","v":15.251377777777778},15.546321777777781,16.640841315555555,16.959852745955558,18.079402411349335,18.424445174469977,19.571067425893219,19.944265678484502,21.120169638957218,21.523820868959952,21.943618148162798,22.380207318533753,22.834260055719547,23.306474902392772,23.79757834293293,24.308325921094688,24.839503402382924,25.391927982922684,25.966449546684039,26.563951972995842]
[null,3,"Cultivos_ClaseCosto2",20.05,null,null,null,21.564888888888891,21.981928888888895,23.52953937777778,23.980609841777781,25.563612013226674,26.051489827089071,27.672771642394856,28.200460285868427,29.863145363969839,30.433893400750851,31.027471359003108,31.644792435585458,32.286806355231093,32.954500831662564,33.64890308715129,34.371081432859562,35.122146912396168,35.903255011114233,36.715607433781031,37.560453953354489]
[null,4,"Cultivos_ClaseCosto3",25.75,null,null,null,27.695555555555558,28.23115555555556,30.218735111111112,30.798040071111114,32.831072785066674,33.457649029802667,35.539843879883669,36.217548746190126,38.352917362704403,39.085922946101462,39.848248752834415,40.641067591836681,41.465599184399039,42.323112040663887,43.21492541117933,44.142411316515393,45.106996658064901,46.110165413276384,47.153460918696332,48.23848824433307]
[null,5,"Cultivos_ClaseCosto4",30.53,null,null,null,32.836711111111114,33.471735111111116,35.828271182222224,36.515113140622226,38.925539888469345,39.668428150674778,42.137143054479552,42.940650998880955,45.472410372169534,46.34148456483409,47.245321725205237,48.185312371991223,49.162902644648646,50.179596528212372,51.236958167118644,52.336614271581162,53.480256620222193,54.669644662808857,55.906608227098992,57.19305033396072]
[null,6,"Cultivos_ClaseCosto5",35.81,null,null,null,38.515644444444447,39.260492444444452,42.024578808888897,42.830206405688898,45.657503550805345,46.528870359504225,49.424536284995504,50.367006625284212,53.33662022362892,54.355996143685189,55.416147100543711,56.518704095676568,57.665363370614742,58.857889016550445,60.098115688323574,61.387951426967625,62.729380595157444,64.124466930074846,65.57535671838896,67.084282098235619]
[null,7,null,"-",null,null,null,"-","-","-","-","-","-","-","-","-","-","-","-","-","-","-","-","-","-","-","-"]
[null,8,"-","-",null,null,null,"-","-","-","-","-","-","-","-","-","-","-","-","-","-","-","-","-","-","-","-"]
[null,9,"-","-",null,null,null,"-","-","-","-","-","-","-","-","-","-","-","-","-","-","-","-","-","-","-","-"]
[null,10,"-","-",null,null,null,"-","-","-","-","-","-","-","-","-","-","-","-","-","-","-","-","-","-","-","-"]
[null,11,"-","-",null,null,null,"-","-","-","-","-","-","-","-","-","-","-","-","-","-","-","-","-","-","-","-"]
{"$rows_left_out":32}
{"sheet":"BI_C","index":4,"n_rows":62,"n_cols":28,"rows_kept":62,"cut":false,"hidden":true,"merged":[]}
[]
[]
[null,"Desglose de costes de diferentes tipos de biodiesel"]
[]
[]
[null,null,"Coste Aceite Crudo"]
[]
[]
[null,null,null,"Costes Agrícolas $MN/litro aceite equivalente",null,null,null,null,null,null,null,null,null,null,null,null,null,null,null,null,null,null,null,"Precios aceites crudos importados"]
[]
[null,null,null,null,null,null,null,null,null,null,null,null,"Cultivos_ClaseCosto1","Cultivos_ClaseCosto2","Cultivos_ClaseCosto3","Cultivos_ClaseCosto4","Cultivos_ClaseCosto5",null,"Import_Ref_Palma",null,null,null,null,null,"PALMA_importado","COCO_importado","SOJA_importado","GIRASOL_importado"]
[null,null,null,null,null,null,null,null,null,null,null,null,6.2949999999999999,12.170999999999999,17.866,22.643000000000001,27.928000000000001,null,"-",null,null,null,null,null,"Average of last 6 months from: http://www.indexmundi.com","Average of last 6 months from: http://www.indexmundi.com","Average of last 6 months from: http://www.indexmundi.com","Average of last 6 months from: http://www.indexmundi.com"]
[null,null,null,null,null,null,null,null,null,null,null,null,null,null,null,null,null,null,null,null,null,null,null,"Precio mercado internacional (USD/t)",601.02166666666665,1300.9642857142858,698.90333333333331,1027.405]
[null,null,null,"Transporte a planta",null,null,null,null,null,null,null,null,null,null,null,null,null,null,null,null,null,null,null,"Precio aceite crudo en USD/litro",{"$f":"IFERROR(Y13*0.9/1000,\"-\")","v":0.5409195},{"$f":"IFERROR(Z13*0.9/1000,\"-\")","v":1.1708678571428572},0.62901300000000004,0.9246645]
[null,null,null,null,null,null,null,null,null,null,null,null,null,null,null,null,null,null,null,null,null,null,null,"Coste aceite crudo en $MX/litro",{"$f":"IFERROR(Y14*MA!$E$9,\"-\")","v":9.4660912499999998},{"$f":"IFERROR(Z14*MA!$E$9,\"-\")","v":20.490187500000001},{"$f":"IFERROR(AA14*MA!$E$9,\"-\")","v":11.007727500000001},{"$f":"IFERROR(AB14*MA!$E$9,\"-\")","v":16.181628750000002}]
[]
[null,null,null,null,"PALMA","COCO","SOJA","GIRASOL","JATROPHA","HIGUERILLA",null,null,"CAT 1","CAT 2","CAT 3","CAT 4","CAT 5",null,"Import_Ref_Palma"]
[null,null,null,"Coste transporte unitario ($MN/t * km)",1.7,1.7,1.7,1.7,1.7,1.7]
[null,null,null,"Distancia media a planta","-",200,150,150,200,100]
[null,null,null,"Transporte a planta ($MN/t materia prima)","-",{"$f":"F19*F18","v":340},{"$f":"G19*G18","v":255},255,340,170]
{"$rows_left_out":43}
{"sheet":"IN","index":5,"n_rows":36,"n_cols":24,"rows_kept":36,"cut":false,"hidden":false,"merged":[]}
[]
[]
[null,"Evolución de la capacidad de producción de biodiesel"]
[]
[]
[null,null,"Capacidad mínima plantas conversión",0.1,"millones m3"]
[null,null,"Maximo incremento capacidad anual ",0.2,"millones m3"]
[]
[]
[null,null,"Demanda biodiesel"]
[]
[null,null,null,null,1,2,3,4,5,6,7,8,9,10,11,12,13,14,15,16,17,18,19,20]
[null,null,null,2016,2017,2018,2019,2020,2021,2022,2023,2024,2025,2026,2027,2028,2029,2030,2031,2032,2033,2034,2035,2036]
[null,null,"Demanda biodiesel",0,{"$f":"INDEX(ResultadosCasacion,MATCH(E$13,ResultadosCasacion_CU,0),MATCH($C$14,ResultadosCasacion_FU,0))","v":0},0.1,0.1,0.2,0.2,0.3,0.3,0.4,0.5,0.5,0.6,0.7,0.8,0.9,1,1.1000000000000001,1.1000000000000001,1.1000000000000001,1.1000000000000001,1.2]
[]
[]
[null,null,"Cálculo capacidad producción"]
[]
[null,null,"millones m3",null,1,2,3,4,5,6,7,8,9,10,11,12,13,14,15,16,17,18,19,20]
[null,null,null,2016,2017,2018,2019,2020,2021,2022,2023,2024,2025,2026,2027,2028,2029,2030,2031,2032,2033,2034,2035,2036]
{"$rows_left_out":17}
{"sheet":"Em","index":6,"n_rows":25,"n_cols":8,"rows_kept":25,"cut":false,"hidden":false,"merged":[]}
[]
[]
[null,"Estimación coeficientes reducción emisiones"]
[]
[null,null,null,null,"Max","Min"]
[null,null,null,"gCO2e/MJ",{"$f":"E16*$E$11","v":52.5426},{"$f":"F16*$E$11","v":36.779820000000001}]
[null,null,null,"tCO2e/M3",{"$f":"E6*PoderCalorifico_Biodiesel/1000","v":1.989262836},{"$f":"F6*PoderCalorifico_Biodiesel/1000","v":1.3924839851999999}]
[]
[null,null,"Comparador fósil"]
[]
[null,null,null,"Factor de emisión del gasoil",83.8,"gCO2e/MJ","Fuente: Directiva Europea de Energías Renovables 2009/28/EC"]
[]
[null,null,"% Reducción de emisiones por tipo de biodiesel"]
[]
[null,null,null,null,"Max \n(Media ponderada reducción emisiones)","Min\n(Media ponderada reducción emisiones)"]
[null,null,null,null,{"$f":"SUMPRODUCT(E20:E22,$H$20:$H$22)","v":0.627},{"$f":"SUMPRODUCT(F20:F22,$H$20:$H$22)","v":0.43890000000000001}]
[]
[null,null,null,null,"Fuente: Directiva Europea de Energías Renovables 2009/28/EC"]
[null,null,null,null,"Max \n(Valor típico en la directiva)","Min\n(valor por defecto en la directiva)",null,"Supuesto % participación en el biodiesel introducido en Mexico"]
[null,null,null,"Aceites usados",0.88,0.83,null,0.33]
{"$rows_left_out":6}
{"sheet":"DI","index":7,"n_rows":60,"n_cols":28,"rows_kept":60,"cut":false,"hidden":false,"merged":[]}
[]
[null,"Escenarios de demanda y precios del combustible diésel"]
[]
[]
[null,null,"Escenario precio internacional del crudo (USD/barril)"]
[]
[null,null,null,null,null,null,null,null,1,2,3,4,5,6,7,8,9,10,11,12,13,14,15,16,17,18,19,20]
[null,null,null,null,null,null,null,2016,2017,2018,2019,2020,2021,2022,2023,2024,2025,2026,2027,2028,2029,2030,2031,2032,2033,2034,2035,2036]
[null,null,null,null,null,null,"Barato",45,44,44,43,43,42,42,41,41,40,40,40,40,40,40,40,40,40,40,40,40]
[null,null,null,null,null,null,"Moderado",45,50,50,55,55,60,60,65,65,70,70,70,70,70,70,70,70,70,70,70,70]
[null,null,null,null,null,null,"Caro",45,50,55,60,70,75,80,90,95,100,100,100,100,100,100,100,100,100,100,100,100]
[]
[null,null,"Precio SPOT del diesel en Houston (USD/litro)"]
[]
[null,null,null,null,null,null,null,null,1,2,3,4,5,6,7,8,9,10,11,12,13,14,15,16,17,18,19,20]
[null,null,null,null,null,null,null,2016,2017,2018,2019,2020,2021,2022,2023,2024,2025,2026,2027,2028,2029,2030,2031,2032,2033,2034,2035,2036]
[null,null,null,null,null,null,"Barato",{"$f":"(H9*0.0076)+0.0207","v":0.36270000000000002},{"$f":"(I9*0.0076)+0.0207","v":0.35509999999999997},0.35509999999999997,0.34749999999999998,0.34749999999999998,0.33989999999999998,0.33989999999999998,0.33229999999999998,0.33229999999999998,0.32469999999999999,0.32469999999999999,0.32469999999999999,0.32469999999999999,0.32469999999999999,0.32469999999999999,0.32469999999999999,0.32469999999999999,0.32469999999999999,0.32469999999999999,0.32469999999999999,0.32469999999999999]
[null,null,null,null,null,null,"Moderado",{"$f":"(H10*0.0076)+0.0207","v":0.36270000000000002},0.4007,0.4007,0.43869999999999998,0.43869999999999998,0.47670000000000001,0.47670000000000001,0.51470000000000005,0.51470000000000005,0.55270000000000008,0.55270000000000008,0.55270000000000008,0.55270000000000008,0.55270000000000008,0.55270000000000008,0.55270000000000008,0.55270000000000008,0.55270000000000008,0.55270000000000008,0.55270000000000008,0.55270000000000008]
[null,null,null,null,null,null,"Caro",0.36270000000000002,0.4007,0.43869999999999998,0.47670000000000001,0.55270000000000008,0.5907,0.62870000000000004,0.7047000000000001,0.74270000000000003,0.78070000000000006,0.78070000000000006,0.78070000000000006,0.78070000000000006,0.78070000000000006,0.78070000000000006,0.78070000000000006,0.78070000000000006,0.78070000000000006,0.78070000000000006,0.78070000000000006,0.78070000000000006]
[]
{"$rows_left_out":41}
{"sheet":"DI_C","index":8,"n_rows":131,"n_cols":8,"rows_kept":131,"cut":false,"hidden":false,"merged":[]}
[]
[]
[null,"Calculo precio SPOT Diesel (USD/galón) en base a precios del crudo (USD/barril)"]
[]
[]
[]
[null,null,null,"U.S. Gulf Coast Ultra-Low Sulfur No 2 Diesel Spot Price",null,"Cushing OK WTI Spot Price FOB"]
[null,null,null,"https://www.eia.gov/dnav/pet/hist/LeafHandler.ashx?n=pet&s=eer_epd2dxl0_pf4_rgc_dpg&f=m",null,"https://www.eia.gov/dnav/pet/hist/LeafHandler.ashx?n=pet&s=rwtc&f=m"]
[null,null,null,"13:38:32 UTC+0200",null,"13:36:57 UTC+0200"]
[null,null,null,"Source: U.S. Energy Information Administration",null,"Data Source: Thomson Reuters",0.26417287,"galon/litro"]
[null,null,"Month","U.S. Gulf Coast Ultra-Low Sulfur No 2 Diesel Spot Price Dollars per Gallon",null,"Cushing OK WTI Spot Price FOB Dollars per Barrel","U.S. Gulf Coast Ultra-Low Sulfur No 2 Diesel Spot Price Dollars per litre"]
[null,null,"2016-05-01",1.3779999999999999,null,46.83,{"$f":"D12*$G$10","v":0.36403021485999998}]
[null,null,"2016-04-01",1.1990000000000001,null,40.75,0.31674327113]
[null,null,"2016-03-01",1.127,null,37.549999999999997,0.29772282448999998]
[null,null,"2016-02-01",0.999,null,30.32,0.26390869712999998]
[null,null,"2016-01-01",0.95799999999999996,null,31.68,0.25307760946000002]
[null,null,"2015-12-01",1.089,null,37.19,0.28768425542999998]
[null,null,"2015-11-01",1.351,null,42.44,0.35689754737000001]
[null,null,"2015-10-01",1.4179999999999999,null,46.22,0.37459712965999997]
[null,null,"2015-09-01",1.444,null,45.48,0.38146562427999997]
{"$rows_left_out":112}
{"sheet":"PO","index":9,"n_rows":22,"n_cols":31,"rows_kept":22,"cut":false,"hidden":false,"merged":[]}
[]
[null,"Escenarios de políticas de apoyo al biodiesel"]
[]
[null,null,"Escenarios Políticas"]
[]
[null,null,null,"Escenario Principal Seleccionado",{"$f":"EscenarioPrincipalSeleccionado","v":"Escenario moderado"}]
[null,null,null,"Instrumento Apoyo Seleccionado",{"$f":"INDEX(Escenarios_General,MATCH('R1'!$C$10,Escenarios_General_CU,0),MATCH($D$12,Escenarios_General_FU,0))","v":"Cuota"}]
[]
[null,null,null,"Situación Actual",null,null,null,null,null,null,"Cálculo Situación futura"]
[]
[null,null,null,null,null,null,null,null,null,null,1,2,3,4,5,6,7,8,9,10,11,12,13,14,15,16,17,18,19,20]
[null,null,null,"Instrumento apoyo",2016,null,null,"Actualizado a futuro según:",null,null,2017,2018,2019,2020,2021,2022,2023,2024,2025,2026,2027,2028,2029,2030,2031,2032,2033,2034,2035,2036]
[null,null,null,"Incentivo Económico",1.71,"peso/litro",null,"Indice inflación",null,null,{"$f":"$E$13*INDEX(Inflacion,MATCH($H$13,Inflacion_CU,0),MATCH(K$12,Inflacion_FU,0))","v":1.7784},1.8495360000000001,1.9235174400000001,2.0004581376000004,2.0804764631040005,2.1636955216281604,2.2502433424932873,2.3402530761930187,2.4338631992407396,2.5312177272103691,2.6324664362987842,2.7377650937507356,2.8472756975007654,2.9611667254007958,3.0796133944168274,3.2027979301935008,3.3309098474012409,3.4641462412972905,3.6027120909491823,3.7468205745871495,"peso/litro"]
[null,null,null,"Cuota",0,"% demanda",null,"No aplica",null,null,{"$f":"INDEX(ValoresCuotaObligatoria,MATCH($E6,ValoresCuotaObligatoria_CU,0),MATCH(K$12,ValoresCuotaObligatoria_FU,0))","v":0},5.0000000000000001E-3,7.4999999999999997E-3,0.01,0.01,1.2500000000000001E-2,1.2500000000000001E-2,1.4999999999999999E-2,1.7500000000000002E-2,1.7500000000000002E-2,0.02,2.2499999999999999E-2,2.5000000000000001E-2,2.75E-2,0.03,3.2500000000000001E-2,3.2500000000000001E-2,3.2500000000000001E-2,3.2500000000000001E-2,3.2500000000000001E-2,"% demanda"]
[]
[]
[null,null,null,null,null,null,null,null,null,null,"Introducción de valores a aplicar en caso de cuota obligatoria "]
[]
[null,null,null,null,null,null,null,null,null,null,2017,2018,2019,2020,2021,2022,2023,2024,2025,2026,2027,2028,2029,2030,2031,2032,2033,2034,2035,2036]
[null,null,null,null,null,null,null,null,null,"Escenario optimista",0,8.0000000000000002E-3,8.0000000000000002E-3,1.2999999999999999E-2,1.7999999999999999E-2,2.3E-2,3.3000000000000002E-2,4.2999999999999997E-2,5.2999999999999999E-2,6.3E-2,6.3E-2,6.3E-2,6.3E-2,6.3E-2,6.3E-2,6.3E-2,6.3E-2,6.3E-2,6.3E-2,6.3E-2]
{"$rows_left_out":3}
{"sheet":"MA","index":10,"n_rows":17,"n_cols":25,"rows_kept":17,"cut":false,"hidden":false,"merged":[]}
[]
[null,"Escenarios macroeconómicos"]
[]
[]
[null,null,"Tipo de cambio $MX/USD"]
[]
[null,null,"Obtenido como el incremento medio del período 2006-2015. Fuente: Fuente: Banco de México. Serie histórica del tipo de cambio, Tipo de cambio peso dólar desde 1954"," ",null,1,2,3,4,5,6,7,8,9,10,11,12,13,14,15,16,17,18,19,20]
[null,null,"Apreciación media anual del dólar frente al peso"," ",2016,2017,2018,2019,2020,2021,2022,2023,2024,2025,2026,2027,2028,2029,2030,2031,2032,2033,2034,2035,2036]
[null,null,1.04,"Tipo cambio",17.5,{"$f":"E9*$C$9","v":18.2},{"$f":"F9*$C$9","v":18.928000000000001},19.685120000000001,20.472524800000002,21.291425792000002,22.143082823680004,23.028806136627203,23.949958382092291,24.907956717375985,25.904274986071027,26.940445985513868,28.018063824934423,29.138786377931801,30.304337833049075,31.51651134637104,32.777171800225879,34.088258672234915,35.451789019124313,36.869860579889284,38.34465500308486]
[]
[]
[null,null,"Inflación"]
[]
[null,null,null,null,"Valor medio entre Mayo 2006-Mayo2016=4%. Fuente: World Bank: Inflation, consumer prices (annual %) ->  http://data.worldbank.org/indicator/FP.CPI.TOTL.ZG",1,2,3,4,5,6,7,8,9,10,11,12,13,14,15,16,17,18,19,20]
[null,null,null,null,2016,2017,2018,2019,2020,2021,2022,2023,2024,2025,2026,2027,2028,2029,2030,2031,2032,2033,2034,2035,2036]
[null,null,null,"Inflación media del período",0.04,0.04,0.04,0.04,0.04,0.04,0.04,0.04,0.04,0.04,0.04,0.04,0.04,0.04,0.04,0.04,0.04,0.04,0.04,0.04,0.04]
[null,null,null,"Indice inflación",1,{"$f":"E17*(1+F16)","v":1.04},{"$f":"F17*(1+G16)","v":1.0816000000000001},{"$f":"G17*(1+H16)","v":1.1248640000000001},{"$f":"H17*(1+I16)","v":1.1698585600000002},1.2166529024000003,1.2653190184960004,1.3159317792358405,1.3685690504052741,1.4233118124214852,1.4802442849183446,1.5394540563150785,1.6010322185676817,1.6650735073103891,1.7316764476028046,1.8009435055069167,1.8729812457271935,1.9479004955562813,2.0258165153785326,2.1068491759936738,2.1911231430334208]

{"sheet":"P","index":11,"n_rows":19,"n_cols":11,"rows_kept":19,"cut":false,"hidden":false,"merged":[]}
[]
[]
[null,"Hoja de parámetros generales"]
[]
[null,null,"Rangos para campos de selección"]
[]
[null,null,"Escenarios_PrecioCrudo",null,"Escenarios_ConsumoDiesel",null,"Escenarios_Demograficos",null,"Escenarios_Recuperacion",null,"Instrumento_politica"]
[null,null,"Escenarios_PrecioCrudo",null,"Escenarios_ConsumoDiesel",null,"Escenarios_Demograficos",null,"Escenarios_Recuperacion",null,"Instrumento_politica"]
[null,null,"Barato",null,"Bajo",null,"Crecimiento moderado",null,"Optimista",null,"Ninguno"]
[null,null,"Moderado",null,"Moderado",null,"Crecimiento alto",null,"Central",null,"Incentivo Económico"]
[null,null,"Caro",null,"Alto",null,"Crecimiento bajo",null,"Pesimista",null,"Cuota"]
[]
[]
[null,null,"Parámetros técnicos"]
[]
[null,null,null,"Poder calorífico biodiesel",37.86,"MJ/litro biodiesel"]
[null,null,null,"Poder calorífico gasoleo mineral",35.86,"MJ/litro gasoleo"]
[null,null,null,"Equivalencia energética gasoleo /biodiesel",{"$f":"E16/E17","v":1.0557724484104851},"litros gasoleo/ litro biodiesel"]
[null,null,null,"Equivalencia litros por barril",159,"litros/barril"]